{"text_format":"1","workbook":"xlsx","n_sheets":12,"sheets":["Readme","List of countries","IFS CODES AND COUNTRIES","Source Data","GDP&Prices","Deficits&Financing","Policies&Assumptions","SEI","Control Panel","DDT Input","DDT Debt Dynamics","DDT Output"],"not_rendered":{"charts":15,"images":2,"macros":1,"external_links":0,"defined_names":18,"comments":0,"pivot_tables":0},"unopened":[],"bounds":{"document_bytes":16777216,"sheet_cells":100000,"rows_first":2000,"rows_last":500,"rows_between":2000,"halvings":0,"cell_chars":16384,"cell_head_chars":4096},"cells_cut":0,"cells_raw":0,"read":"whole","date_system":"1900"}

{"sheet":"Readme","index":0,"n_rows":59,"n_cols":6,"rows_kept":59,"cut":false,"hidden":false,"merged":[[2,1,2,16],[1,1,1,16],[16,1,16,16]]}
[]
[null,"Macroframework Foundations Tool (MFT) 1.0"]
[null,"The Macroframework Foundations Tool (MFT) is a macroeconomic projection tool based on a multi-sector macroeconomic framework that can be used for forecasting and policy analysis, developed by the IMF Institute for Capacity Development (Version: 1.0, May 2025). "]
[]
[null,"Basic Inputs"]
[null,null,"Use drop-down list below"]
[null,"Select country","Macrofoundland",null,"General conventions"]
[]
[null,"IFS Code",{"$f":"VLOOKUP(C7,'IFS CODES AND COUNTRIES'!$B$3:$C$201,2,FALSE)","v":999},null,null,"= yellow shade generally indicates cells that users need to provide inputs or make assumptions or discretions."]
[]
{"$rows_left_out":50}
{"sheet":"List of countries","index":1,"n_rows":204,"n_cols":6,"rows_kept":204,"cut":false,"hidden":true,"merged":[]}
[]
[null,null,"Countries","Years","Definition public sector","Guarantees"]
[null,null,"Choose Country","Choose Year","Choose Sector","Choose Guarantees"]
[null,null,"Afghanistan",2010,"Consolidated Public Sector","Yes"]
[null,null,"Albania",2011,"Non-financial Public Sector","No"]
[null,null,"Algeria",2012,"General Government"]
[null,null,"Angola",2013,"Central Government"]
[null,null,"Anguilla",2014,"Other"]
[null,null,"Antigua and Barbuda",2015]
[null,null,"Argentina",2016]
{"$rows_left_out":195}
{"sheet":"IFS CODES AND COUNTRIES","index":2,"n_rows":201,"n_cols":5,"rows_kept":201,"cut":false,"hidden":true,"merged":[[0,0,0,4]]}
["List of Countries"]
["#","Name","Code","ISO-3 code","ISO-2 code"]
[1,"Afghanistan",512,"AFG","AF"]
[2,"Albania","914","ALB","AL"]
[3,"Algeria","612","DZA","DZ"]
[4,"Angola","614","AGO","AO"]
[5,"Anguilla","312","AIA","AI"]
[6,"Antigua and Barbuda","311","ATG","AG"]
[7,"Argentina","213","ARG","AR"]
[8,"Armenia","911","ARM","AM"]
{"$rows_left_out":192}
{"sheet":"Source Data","index":3,"n_rows":115,"n_cols":20,"rows_kept":115,"cut":false,"hidden":false,"merged":[[0,1,0,18]]}
[null,{"$f":"\"Country:\"&\" \"&Country_Name &\" - Historical Source Data\"","v":"Country: Macrofoundland - Historical Source Data"}]
[null,null,null,null,null,null,null,null,null,null,null,null,null,null,"First Year of Projection"]
[null,"Year/Variable",{"$f":"+D3-1","v":2012},2013,2014,2015,2016,2017,2018,2019,2020,2021,2022,{"$f":"+O3-1","v":2023},{"$f":"First_Year","v":2024},{"$f":"O3+1","v":2025},{"$f":"P3+1","v":2026},2027,2028]
[null,"National Accounts: Expenditure, constant prices, local currency (LC) in billions"]
[null,"Private consumption",915.59609989413286,935.95000658659501,985.61963416907884,1049.0588897012908,1112.3761886063119,1160.7652169137991,1226.6912996176297,1283.4287885329679,1240.1175608410888,1321.9498358590299,1389.5449627672688,1435.0947919830619,null,null,null,null,null,{"$f":"'GDP&Prices'!T9","v":0}]
[null,"Public consumption",109.7237637216021,116.61484895532149,121.64673640488037,130.04287145389191,132.57765082433269,133.67367061270107,137.43973526167218,146.15968400226831,153.36957499389609,153.4638680184477,159.40934272309829,171.84800646904588]
[null,"Gross capital formation",286.02829329504078,278.97531258020689,305.05710183301642,362.64447364286605,407.31174702305918,406.2438026707004,460.40901220790414,497.82496166063987,437.7615700050809,534.38180904351805,555.86427142073796,566.98155684915287]
[null,"Private capital formation",219.6151837532681,234.94692776379227,263.80269896447595,307.61191619905316,362.93144020999665,353.23790834315622,408.88520529587845,446.26411415785429,378.97263468774776,480.49050140778746,502.32731651847428,500.3240216512076]
[null,"Public capital formation",66.41310954177284,44.028384816414736,41.254402868540744,55.032557443812969,44.380306813062425,53.005894327544404,51.523806912026039,51.560847502785947,58.788935317332921,53.891307635730939,53.536954902263766,66.65753519794481]
[null,"Exports of goods and services (G&S)",313.5084364348391,341.87594710907467,376.73837729234799,383.142492213124,416.85090896971599,431.84333379564583,447.99098782375597,465.02823912821708,334.03775355135798,431.23375372286699,501.66225853401971,503.49597812805001]
{"$rows_left_out":106}
{"sheet":"GDP&Prices","index":4,"n_rows":170,"n_cols":24,"rows_kept":170,"cut":false,"hidden":false,"merged":[[0,1,0,18]]}
[null,{"$f":"\"Country:\"&\" \"&Country_Name&\" - Output, Demand & Prices\"","v":"Country: Macrofoundland - Output, Demand & Prices"}]
[]
[null,"Instructions: Calibration of behavioral equations can be found at the bottom of the sheet."]
[null,null,null,null,null,null,null,null,null,null,null,null,null,null,"First Year of Projection"]
[null,"Year/Variable",null,null,{"$f":"F5-1","v":2014},2015,2016,2017,2018,2019,2020,2021,2022,{"$f":"O5-1","v":2023},{"$f":"First_Year","v":2024},{"$f":"O5+1","v":2025},{"$f":"P5+1","v":2026},2027,2028]
[null,"Real Expenditure, [Units], constant prices"]
[null,"Consumption",null,null,{"$f":"E9+E13","v":1107.2663705739592},1179.1017611551827,1244.9538394306446,1294.4388875265001,1364.131034879302,1429.5884725352362,1393.4871358349849,1475.4137038774777,1548.954305490367,{"$f":"N9+N13","v":1606.9427984521078},{"$f":"O9+O13","v":1685.0943723388502},{"$f":"P9+P13","v":1773.7145622870155},{"$f":"Q9+Q13","v":1868.7373772380281},1966.7698444654829,2069.0175214195128]
[null,"Growth rate",null,null,{"$f":"E7/('Source Data'!D5+'Source Data'!D6)-1","v":5.196973349815992E-2},{"$f":"F7/E7-1","v":6.4876340951262712E-2},5.5849359609933646E-2,3.9748500328724345E-2,5.3839658267663904E-2,{"$f":"J7/I7-1","v":4.7984714065042677E-2},{"$f":"K7/J7-1","v":-2.5252957332699499E-2},5.879248249636837E-2,{"$f":"M7/L7-1","v":4.9844054870589849E-2},{"$f":"N7/M7-1","v":3.7437187627935131E-2},{"$f":"O7/N7-1","v":4.863369994378286E-2},5.2590639078073487E-2,{"$f":"Q7/P7-1","v":5.3572777137540495E-2},{"$f":"R7/Q7-1","v":5.2459199682914015E-2},{"$f":"S7/R7-1","v":5.1987616772626533E-2}]
[null,"Private",null,null,{"$f":"'Source Data'!E5","v":985.61963416907884},{"$f":"'Source Data'!F5","v":1049.0588897012908},{"$f":"'Source Data'!G5","v":1112.3761886063119},{"$f":"'Source Data'!H5","v":1160.7652169137991},{"$f":"'Source Data'!I5","v":1226.6912996176297},{"$f":"'Source Data'!J5","v":1283.4287885329679},{"$f":"'Source Data'!K5","v":1240.1175608410888},{"$f":"'Source Data'!L5","v":1321.9498358590299},{"$f":"'Source Data'!M5","v":1389.5449627672688},{"$f":"'Source Data'!N5","v":1435.0947919830619},{"$f":"N9*(1+O10)","v":1503.2820125335097},1580.5836370914626,{"$f":"P9*(1+Q10)","v":1663.1819974637217},{"$f":"Q9*(1+R10)","v":1747.8367776065677},{"$f":"R9*(1+S10)","v":1835.8156615378359}]
[null,"Actual",null,null,{"$f":"E9/'Source Data'!D5-1","v":5.3068675926002395E-2},{"$f":"F9/E9-1","v":6.4364845557986605E-2},6.0356286502705414E-2,4.3500597013060416E-2,5.6795363733514126E-2,{"$f":"J9/I9-1","v":4.6252458897380055E-2},{"$f":"K9/J9-1","v":-3.3746498503735678E-2},6.5987514088938326E-2,5.1132898597709753E-2,3.278039245673714E-2,{"$f":"O11+O12","v":4.7514088220071034E-2},{"$f":"P11+P12","v":5.1421904814569548E-2},{"$f":"Q11+Q12","v":5.2258139609906315E-2},5.0899288395341462E-2,5.0335869492198003E-2]
{"$rows_left_out":161}
{"sheet":"Deficits&Financing","index":5,"n_rows":112,"n_cols":21,"rows_kept":112,"cut":false,"hidden":false,"merged":[[0,1,0,18]]}
[null,{"$f":"\"Country:\"&\" \"&Country_Name&\" - Deficits & Financing\"","v":"Country: Macrofoundland - Deficits & Financing"}]
[]
[null,"Instructions: Calibration of behavioral equations can be found at the bottom of the sheet."]
[null,null,null,null,null,null,null,null,null,null,null,null,null,null,"First Year of Projection"]
[null,"Year/Variable",null,null,{"$f":"+F5-1","v":2014},2015,2016,2017,2018,2019,2020,2021,2022,{"$f":"+O5-1","v":2023},{"$f":"First_Year","v":2024},{"$f":"+O5+1","v":2025},{"$f":"+P5+1","v":2026},2027,2028]
[null,"Nominal GDP & National Income, [Units], current prices"]
[null,"Consumption",null,null,{"$f":"E9+E10","v":1680.9845267659541},1822.2238098479968,1972.2911232702697,2139.8394798078107,2347.0912923855394,2518.6927418940954,{"$f":"K9+K10","v":2568.0800958929171},2939.7927515320598,{"$f":"M9+M10","v":3366.9788436597601},{"$f":"N9+N10","v":3667.3450386424324},4018.4557996335952,{"$f":"P9+P10","v":4402.1058381267176},{"$f":"Q9+Q10","v":4817.7421493109541},5263.8702356401673,5748.437433615637]
[null,null,null,null,{"$f":"E7/('Source Data'!D15+'Source Data'!D16)-1","v":9.6157115772099067E-2},{"$f":"F7/E7-1","v":8.4021762742678474E-2},8.235394171190813E-2,8.4951128441792978E-2,9.6853906348313146E-2,{"$f":"J7/I7-1","v":7.3112388114287441E-2},{"$f":"K7/J7-1","v":1.9608328232081806E-2},0.14474340431734034,0.14531163528622004,8.9209409660616412E-2,9.5739767404360743E-2,{"$f":"P7/O7-1","v":9.5472006567324685E-2},{"$f":"Q7/P7-1","v":9.4417609768580046E-2},9.2601071726725603E-2,9.205530841064502E-2]
[null,"Private",null,null,{"$f":"'Source Data'!E15","v":1466.536113922572},{"$f":"'Source Data'!F15","v":1591.348610463423},{"$f":"'Source Data'!G15","v":1720.7916577017388},{"$f":"'Source Data'!H15","v":1848.66820909743},{"$f":"'Source Data'!I15","v":2025.0864616863018},{"$f":"'Source Data'!J15","v":2165.2035558141097},{"$f":"'Source Data'!K15","v":2174.172606398653},{"$f":"'Source Data'!L15","v":2506.9962415488199},{"$f":"'Source Data'!M15","v":2869.8291578619105},{"$f":"'Source Data'!N15","v":3105.7531755951049},{"$f":"N9*(1+'GDP&Prices'!O10)*(1+'GDP&Prices'!O71)","v":3397.8967909662983},{"$f":"O9*(1+'GDP&Prices'!P10)*(1+'GDP&Prices'!P71)","v":3716.3881335493543},{"$f":"P9*(1+'GDP&Prices'!Q10)*(1+'GDP&Prices'!Q71)","v":4060.0240857529675},{"$f":"Q9*(1+'GDP&Prices'!R10)*(1+'GDP&Prices'!R71)","v":4426.5917754085922},{"$f":"R9*(1+'GDP&Prices'!S10)*(1+'GDP&Prices'!S71)","v":4823.2447350597467}]
[null,"Public",null,null,{"$f":"'Source Data'!E16","v":214.44841284338221},{"$f":"'Source Data'!F16","v":230.87519938457379},{"$f":"'Source Data'!G16","v":251.49946556853087},{"$f":"'Source Data'!H16","v":291.1712707103809},{"$f":"'Source Data'!I16","v":322.00483069923769},{"$f":"'Source Data'!J16","v":353.48918607998587},{"$f":"'Source Data'!K16","v":393.90748949426421},{"$f":"'Source Data'!L16","v":432.79650998324018},{"$f":"'Source Data'!M16","v":497.14968579784966},{"$f":"'Source Data'!N16","v":561.59186304732759},{"$f":"N10*(1+'GDP&Prices'!O14)*(1+'GDP&Prices'!O71)","v":620.55900866729701},{"$f":"O10*(1+'GDP&Prices'!P14)*(1+'GDP&Prices'!P71)","v":685.71770457736307},{"$f":"P10*(1+'GDP&Prices'!Q14)*(1+'GDP&Prices'!Q71)","v":757.71806355798628},{"$f":"Q10*(1+'GDP&Prices'!R14)*(1+'GDP&Prices'!R71)","v":837.27846023157474},{"$f":"R10*(1+'GDP&Prices'!S14)*(1+'GDP&Prices'!S71)","v":925.19269855589005}]
{"$rows_left_out":103}
{"sheet":"Policies&Assumptions","index":6,"n_rows":210,"n_cols":24,"rows_kept":210,"cut":false,"hidden":false,"merged":[[0,1,0,18],[129,1,129,18],[128,1,128,18]]}
[null,{"$f":"\"Country:\"&\" \"&Country_Name&\" - Fiscal & Monetary Policies\"","v":"Country: Macrofoundland - Fiscal & Monetary Policies"}]
[]
[null,"Instructions: Calibration of behavioral equations can be found at the bottom of the sheet."]
[null,null,null,null,null,null,null,null,null,null,null,null,null,null,"First Year of Projection"]
[null,"Year/Variable",null,null,{"$f":"F5-1","v":2014},2015,2016,2017,2018,2019,2020,2021,2022,{"$f":"O5-1","v":2023},{"$f":"First_Year","v":2024},{"$f":"'Source Data'!P3","v":2025},{"$f":"+P5+1","v":2026},{"$f":"+Q5+1","v":2027},2028]
[null,"Government Budget, [Units], current prices"]
[null,"Total revenue",null,null,{"$f":"E9+E11+E13","v":290.7154082831679},372.53966361180278,337.52571939852641,370.19298790206159,{"$f":"I9+I11+I13","v":419.02393759802095},457.96063490856062,440.71413388673716,586.43513555363654,665.54362843155457,747.35682044352689,822.3133745770217,{"$f":"P9+P11+P13","v":907.08619384572205},993.95552385462906,1087.4749008422727,1188.7527429491488]
[null,null,null,null,{"$f":"E7/SUM('Source Data'!D63:D65)-1","v":0.1312116289872729},{"$f":"F7/E7-1","v":0.2814582681112483},-9.398715796812962E-2,9.6784531151429043E-2,0.13190673862487667,{"$f":"J7/I7-1","v":9.2922369862059151E-2},{"$f":"K7/J7-1","v":-3.7659352588824579E-2},0.33064744346127428,0.1348972598704099,0.12292686537286279,0.10029553766433952,0.10309064875942875,{"$f":"Q7/P7-1","v":9.5767448119359111E-2},{"$f":"R7/Q7-1","v":9.4088090204448083E-2},{"$f":"S7/R7-1","v":9.31311996519959E-2}]
[null,"  Tax revenue",null,null,{"$f":"'Source Data'!E63","v":272.22828533496403},{"$f":"'Source Data'!F63","v":286.94325924007796},{"$f":"'Source Data'!G63","v":314.03638623674101},{"$f":"'Source Data'!H63","v":345.335532728739},{"$f":"'Source Data'!I63","v":384.95908421934598},{"$f":"'Source Data'!J63","v":423.76571970668596},{"$f":"'Source Data'!K63","v":385.42358978731994},{"$f":"'Source Data'!L63","v":541.77624117760502},{"$f":"'Source Data'!M63","v":604.53118138786863},{"$f":"'Source Data'!N63","v":678.31526463623993},{"$f":"(O33/100)*O79","v":747.3043624381728},{"$f":"(P33/100)*P79","v":824.37796695789439},903.33913415788766,988.34032895881069,1080.3903627762006]
[null,null,null,null,{"$f":"'Source Data'!E63/'Source Data'!D63-1","v":0.10879180021960155},{"$f":"F9/E9-1","v":5.4053802260143113E-2},9.4419806439833165E-2,9.9667261068284718E-2,0.11473928320527405,{"$f":"J9/I9-1","v":0.10080716906846221},{"$f":"K9/J9-1","v":-9.047954597626473E-2},0.40566445732229783,0.11583184244820233,0.12205174111776929,0.1017065388303322,0.10313549390807708,{"$f":"Q9/P9-1","v":9.5782723901967515E-2},{"$f":"R9/Q9-1","v":9.4096659368314572E-2},{"$f":"S9/R9-1","v":9.3135968573054395E-2}]
{"$rows_left_out":201}
{"sheet":"SEI","index":7,"n_rows":99,"n_cols":23,"rows_kept":99,"cut":false,"hidden":false,"merged":[[3,18,3,22],[2,18,2,22],[0,1,0,22]]}
[null,{"$f":"\"Country:\"&\" \"&Country_Name&\" - Selected Economic Indicators\"","v":"Country: Macrofoundland - Selected Economic Indicators"}]
[]
[null,null,null,null,null,null,null,null,null,null,null,null,null,null,null,null,null,null,"Baseline results are copied and pasted here"]
[null,null,null,null,null,null,null,null,null,null,null,null,"First Year of Projection",null,"Active Scenario",null,null,null,"Baseline Scenario"]
[null,"Year/Variable",{"$f":"+D5-1","v":2014},2015,2016,2017,2018,2019,2020,2021,2022,{"$f":"+M5-1","v":2023},{"$f":"First_Year","v":2024},{"$f":"M5+1","v":2025},{"$f":"N5+1","v":2026},2027,{"$f":"P5+1","v":2028},null,{"$f":"M5","v":2024},{"$f":"N5","v":2025},{"$f":"O5","v":2026},2027,2028]
[null,"Real GDP growth and the business cycle (percent)",null,null,null,null,null,"(In percent change)"]
[null,"Actual",{"$f":"100*'GDP&Prices'!E55","v":7.4410143225613901},{"$f":"100*'GDP&Prices'!F55","v":6.5383365279745975},{"$f":"100*'GDP&Prices'!G55","v":7.0003942214849513},{"$f":"100*'GDP&Prices'!H55","v":4.3329521915414393},{"$f":"100*'GDP&Prices'!I55","v":6.3712697254609152},{"$f":"100*'GDP&Prices'!J33","v":5.6558457212700919},{"$f":"100*'GDP&Prices'!K33","v":-6.1763550002351453},{"$f":"100*'GDP&Prices'!L33","v":11.041475065476526},{"$f":"100*'GDP&Prices'!M33","v":5.405733079913011},{"$f":"100*'GDP&Prices'!N33","v":2.9038356380300057},{"$f":"100*'GDP&Prices'!O33","v":3.6551901366708162},{"$f":"100*'GDP&Prices'!P33","v":5.7197229237134106},{"$f":"100*'GDP&Prices'!Q33","v":5.2201636441410182},{"$f":"100*'GDP&Prices'!R33","v":5.1743704175321037},{"$f":"100*'GDP&Prices'!S33","v":5.1061930278920808},null,3.1724516702943406,5.6048697944482972,5.0801313072475818,5.2413468543851538,5.1105527227359504]
[null,"Potential",{"$f":"100*'GDP&Prices'!E57","v":5},{"$f":"100*'GDP&Prices'!F57","v":5},{"$f":"100*'GDP&Prices'!G57","v":5},{"$f":"100*'GDP&Prices'!H57","v":5},{"$f":"100*'GDP&Prices'!I57","v":5},{"$f":"100*'GDP&Prices'!J57","v":5},{"$f":"100*'GDP&Prices'!K57","v":3},{"$f":"100*'GDP&Prices'!L57","v":4},{"$f":"100*'GDP&Prices'!M57","v":5},{"$f":"100*'GDP&Prices'!N57","v":5},{"$f":"100*'GDP&Prices'!O57","v":5},{"$f":"100*'GDP&Prices'!P57","v":5},{"$f":"100*'GDP&Prices'!Q57","v":5},{"$f":"100*'GDP&Prices'!R57","v":5},{"$f":"100*'GDP&Prices'!S57","v":5},null,5,5,5,5,5]
[null,"Output gap",{"$f":"100*'GDP&Prices'!E58","v":0},{"$f":"100*'GDP&Prices'!F58","v":1.4650824075948501},{"$f":"100*'GDP&Prices'!G58","v":3.398131593600997},{"$f":"100*'GDP&Prices'!H58","v":2.7412601928560156},{"$f":"100*'GDP&Prices'!I58","v":4.0830314276956932},{"$f":"100*'GDP&Prices'!J58","v":4.7331496259687658},{"$f":"100*'GDP&Prices'!K58","v":-4.5976131047170048},{"$f":"100*'GDP&Prices'!L58","v":1.861747746341446},{"$f":"100*'GDP&Prices'!M58","v":2.2553542286123376},{"$f":"100*'GDP&Prices'!N58","v":0.21398252047293378},{"$f":"100*'GDP&Prices'!O58","v":-1.0695235728474677},{"$f":"100*'GDP&Prices'!P58","v":-0.39140944951559875},{"$f":"100*'GDP&Prices'!Q58","v":-0.1825499255366777},{"$f":"100*'GDP&Prices'!R58","v":-1.6786160242218365E-2},{"$f":"100*'GDP&Prices'!S58","v":8.433196044025458E-2},null,-1.5302605998484697,-0.96301234748912934,-0.88743240229503273,-0.6596169244045339,-0.55501788106778993]
[null,"Unemployment rate",{"$f":"'GDP&Prices'!E59","v":8.3668938357926308},{"$f":"'GDP&Prices'!F59","v":7.1814457534963081},{"$f":"'GDP&Prices'!G59","v":6.9384698686206328},{"$f":"'GDP&Prices'!H59","v":5.6189701476845162},{"$f":"'GDP&Prices'!I59","v":5.7687976099708083},{"$f":"'GDP&Prices'!J59","v":6.2903472981720121},{"$f":"'GDP&Prices'!K59","v":5.9455437384130203},{"$f":"'GDP&Prices'!L59","v":7.2362608515153024},{"$f":"'GDP&Prices'!M59","v":5.3990607745196675},{"$f":"'GDP&Prices'!N59","v":6.0759999999999996},{"$f":"'GDP&Prices'!O59","v":6.4278094291389873},{"$f":"'GDP&Prices'!P59","v":6.1565637798062394},{"$f":"'GDP&Prices'!Q59","v":6.0730199702146708},{"$f":"'GDP&Prices'!R59","v":6.0067144640968877},{"$f":"'GDP&Prices'!S59","v":5.9662672158238985},null,6.6121042399393879,6.3852049389956518,6.3549729609180128,6.2638467697618134,6.2220071524271159]
{"$rows_left_out":90}
{"sheet":"Control Panel","index":8,"n_rows":107,"n_cols":8,"rows_kept":107,"cut":false,"hidden":false,"merged":[[3,1,3,7],[2,1,2,7],[47,1,47,7]]}
[]
[]
[null,"The Control Panel can be completed after the model is finalized. Policy change values will need to be linked to the Policies & Assumptions sheet. More variables could be added to the Key Outcomes and aligned with the projection in the SEI sheet. "]
[null,{"$f":"\"\"&\" \"&Country_Name&\" - Baseline and Alternative Policy Scenarios\"","v":" Macrofoundland - Baseline and Alternative Policy Scenarios"}]
[]
[null,"Policy Instruments",{"$f":"D6-1","v":2023},{"$f":"First_Year","v":2024},{"$f":"D6+1","v":2025},{"$f":"E6+1","v":2026},2027,2028]
[null,"Fiscal Policy (percent of GDP, unless otherwise indicated)"]
[null,"Revenue: Baseline ",{"$f":"'Policies&Assumptions'!N32","v":15.858233530308803},{"$f":"SEI!S35","v":15.631628285126464},{"$f":"SEI!T35","v":15.631153050855588},{"$f":"SEI!U35","v":15.631148673292095},{"$f":"SEI!V35","v":15.631128357578705},{"$f":"SEI!W35","v":15.631207136416396}]
[null,"Revenue: Scenario",{"$f":"'Policies&Assumptions'!N32","v":15.858233530308803},{"$f":"'Policies&Assumptions'!O32","v":15.631267498539003},{"$f":"'Policies&Assumptions'!P32","v":15.63063204938665},{"$f":"'Policies&Assumptions'!Q32","v":15.630414150224698},{"$f":"'Policies&Assumptions'!R32","v":15.630291729980554},{"$f":"'Policies&Assumptions'!S32","v":15.63022354118289}]
[null,"Additional revenue measures (please specify)","…",0,0,0,0,0]
{"$rows_left_out":98}
{"sheet":"DDT Input","index":9,"n_rows":21,"n_cols":16,"rows_kept":21,"cut":false,"hidden":false,"merged":[[3,0,3,15],[4,0,4,15],[0,0,0,15]]}
["Cell codes: Yellow-shaded cells contain historical data to be populate by users. Grey (empty) cells refer to values to be generated by the template in other worksheets. "]
[]
[]
["Historical Data and Forecasts. Variables in percent or percent of GDP, unless otherwise indicated."]
[{"$f":"\"Country:\"&\" \"&Country_Name","v":"Country: Macrofoundland"}]
[]
[null,null,null,null,null,null,null,null,null,null,null,"First Year of Projection"]
["Year/Variable",{"$f":"C8-1","v":2014},2015,2016,2017,2018,2019,2020,2021,2022,{"$f":"L8-1","v":2023},{"$f":"First_Year","v":2024},{"$f":"L8+1","v":2025},2026,2027,2028]
["dt (debt including uncalled guarantees): Stock of total gross public debt, percent of GDP",{"$f":"'Policies&Assumptions'!E57*100","v":44.692832778829022},{"$f":"'Policies&Assumptions'!F57*100","v":44.687473720103149},{"$f":"'Policies&Assumptions'!G57*100","v":46.401255029620735},{"$f":"'Policies&Assumptions'!H57*100","v":48.906423787152455},{"$f":"'Policies&Assumptions'!I57*100","v":50.807990612051142},{"$f":"'Policies&Assumptions'!J57*100","v":53.579255664654568},{"$f":"'Policies&Assumptions'!K57*100","v":71.084435248610689},{"$f":"'Policies&Assumptions'!L57*100","v":63.562789250751408},{"$f":"'Policies&Assumptions'!M57*100","v":59.547117496047605},{"$f":"'Policies&Assumptions'!N57*100","v":60.799336401706171}]
["o/w stock of local-currency guarantees (uncalled): Stock of uncalled guarantees in local currency included in total debt, percent of GDP",0,0,0,0,0,0,0,0,0,0,0,0,0,0,0]
{"$rows_left_out":12}
{"sheet":"DDT Debt Dynamics","index":10,"n_rows":97,"n_cols":16,"rows_kept":97,"cut":false,"hidden":false,"merged":[[0,0,1,15],[3,0,3,15],[4,0,4,15]]}
["Cell code: Yellow cells are values to be inputted by the user. White cells refer to values generated by the template, or constructed to satisfy certain constraints, using formulas (e.g., accounting definitions, solutions to equations). "]
[]
[]
["Baseline Scenario. Units of macro fiscal variables are as indicated in \"Input - Data\"."]
[{"$f":"\"Country:\"&\" \"&Country_Name","v":"Country: Macrofoundland"}]
[]
[null,null,null,null,null,null,null,null,null,null,null,"First Year of Projection"]
["Year",{"$f":"C8-1","v":2014},2015,2016,2017,2018,2019,2020,2021,2022,{"$f":"L8-1","v":2023},{"$f":"First_Year","v":2024},{"$f":"L8+1","v":2025},2026,2027,2028]
["dt (debt including uncalled guarantees)",{"$f":"'DDT Input'!B9","v":44.692832778829022},{"$f":"'DDT Input'!C9","v":44.687473720103149},{"$f":"'DDT Input'!D9","v":46.401255029620735},{"$f":"'DDT Input'!E9","v":48.906423787152455},{"$f":"'DDT Input'!F9","v":50.807990612051142},{"$f":"'DDT Input'!G9","v":53.579255664654568},{"$f":"'DDT Input'!H9","v":71.084435248610689},{"$f":"'DDT Input'!I9","v":63.562789250751408},{"$f":"'DDT Input'!J9","v":59.547117496047605},{"$f":"'DDT Input'!K9","v":60.799336401706171},{"$f":"(K9-K10-K11)*(L23)-L20*L24+L20*L25+(L10+L11)","v":60.469660576787433},{"$f":"(L9-L10-L11)*(M23)-M20*M24+M20*M25+(M10+M11)","v":58.138120648902628},{"$f":"(M9-M10-M11)*(N23)-N20*N24+N20*N25+(N10+N11)","v":58.275023191859859},56.460253425719102,56.878414341103102]
["o/w stock of local-currency guarantees (uncalled)",{"$f":"'DDT Input'!B10","v":0},{"$f":"'DDT Input'!C10","v":0},{"$f":"'DDT Input'!D10","v":0},{"$f":"'DDT Input'!E10","v":0},{"$f":"'DDT Input'!F10","v":0},{"$f":"'DDT Input'!G10","v":0},{"$f":"'DDT Input'!H10","v":0},{"$f":"'DDT Input'!I10","v":0},{"$f":"'DDT Input'!J10","v":0},{"$f":"'DDT Input'!K10","v":0},{"$f":"'DDT Input'!L10","v":0},{"$f":"'DDT Input'!M10","v":0},{"$f":"'DDT Input'!N10","v":0},{"$f":"'DDT Input'!O10","v":0},{"$f":"'DDT Input'!P10","v":0}]
{"$rows_left_out":88}
{"sheet":"DDT Output","index":11,"n_rows":75,"n_cols":36,"rows_kept":75,"cut":false,"hidden":false,"merged":[[41,22,41,24],[3,1,3,19],[4,1,4,20],[22,22,22,24],[26,22,26,24],[30,22,30,24],[34,22,34,24],[35,22,35,24],[39,22,40,24],[20,7,20,10],[20,13,20,19],[20,22,20,24],[21,7,21,8],[8,7,8,10],[8,13,8,18],[9,7,9,8],[6,0,6,20],[18,1,18,21],[18,26,18,28],[20,26,20,28],[39,26,40,28],[21,22,21,24],[6,26,6,28],[18,22,18,24],[41,26,41,28],[21,26,21,28],[22,26,22,28],[26,26,26,28],[30,26,30,28],[34,26,34,28],[35,26,35,28]]}
[]
[]
[null,null,null,null,null,null,null,null,null,null,"ACTIVE SCENARIO",null,null,null,null,null,null,null,null,null,null,null,null,null,null,null,null,null,null,null,null,null,null,null,null,"BASELINE"]
[null,{"$f":"Country_Name&\" - Public Sector Debt Dynamics\"","v":"Macrofoundland - Public Sector Debt Dynamics"}]
[null,"(in percent of GDP unless otherwise indicated)"]
[]
["Debt and Economic Indicators 1/"]
[]
[null,null,null,null,null,null,null,"Actual",null,null,null,"Est.",null,"Projections"]
[null,null,null,null,null,null,null,{"$f":"CONCATENATE('DDT Debt Dynamics'!C8,\"-\",'DDT Debt Dynamics'!I8)","v":"2015-2021"},null,"2/",{"$f":"'DDT Debt Dynamics'!J8","v":2022},{"$f":"'DDT Debt Dynamics'!K8","v":2023},null,{"$f":"'DDT Debt Dynamics'!L8","v":2024},{"$f":"'DDT Debt Dynamics'!M8","v":2025},{"$f":"'DDT Debt Dynamics'!N8","v":2026},{"$f":"'DDT Debt Dynamics'!O8","v":2027},{"$f":"'DDT Debt Dynamics'!P8","v":2028}]
{"$rows_left_out":65}